{"text_format":"1","workbook":"xlsx","n_sheets":11,"sheets":["Info","About","Outputs =>","O1 User interface","O2 Dashboard","Inputs =>","I1 Inputs","I2 Definitions","Calculations =>","C1 Portfolio construction","C2 Dashboard data"],"not_rendered":{"charts":6,"images":3,"macros":1,"external_links":0,"defined_names":144,"comments":0,"pivot_tables":0},"unopened":[],"bounds":{"document_bytes":16777216,"sheet_cells":100000,"rows_first":2000,"rows_last":500,"rows_between":2000,"halvings":0,"cell_chars":16384,"cell_head_chars":4096},"cells_cut":0,"cells_raw":0,"read":"whole","date_system":"1900"}

{"sheet":"Info","index":0,"n_rows":8,"n_cols":4,"rows_kept":8,"cut":false,"hidden":false,"merged":[]}
[]
[]
[null,"Creation Date",null,"2020-03-27"]
[null,"Client",null,"Austroads"]
[null,"Project",null,"Investment prioritisation framework"]
[null,"Description",null,"Investment prioritisation template"]
[null,"Author",null,"Martin Chow and Dylan Frangos"]
[null,"Version",null,1]

{"sheet":"About","index":1,"n_rows":82,"n_cols":5,"rows_kept":82,"cut":false,"hidden":false,"merged":[[6,1,6,5],[8,1,8,5],[13,1,13,5],[24,1,24,5],[27,1,27,5],[48,1,48,5],[32,1,32,5],[35,1,35,5],[40,1,40,5],[43,1,43,5],[46,1,46,5]]}
[{"$f":"MID(CELL(\"filename\",A2),FIND(\"]\",CELL(\"filename\",A2))+1,256)","v":"About"}]
["Insert description"]
[]
[null,"About the Austroads investment prioritisation tool"]
[]
[null,"General"]
[null,"The Austroads investment prioritisation tool illustrates how to draw upon the outputs of the decision-making processes of road authorities to enable a like-for-like comparison of different investments. In general, the investment prioritisation tool compares various user defined scenarios to compare and contrast the investments undertaken in each scenario."]
[]
[null,"The layout of the investment prioritisation tool follows two modelling conventions:\n1) Colour scheme for cells; and\n2) Outputs, inputs and calculation tab structure"]
[]
[null,"These modelling conventions are described below"]
[]
[null,"Colour scheme"]
[null,"Each cell in the investment prioritisation tool follows a colour scheme that provides guidance as to which cells can be modified by the user and which cells should not be modified. Each colour used is described below."]
[]
[null,"Colour","Cell type","Cell description","User inputs"]
[null,null,"Parameter cell","These cells provide the tool with general parameter inputs such as discount rates and funding levels. They allow the user to change parameters as required.","Yes"]
[null,null,"Input cell","These cells provide the tool with input estimates. They allow the user to enter inputs relevant to the calculation.","Yes"]
[null,null,"Calculation cell","Calculation cells are where the tool makes calculations required for optimisation and production of the dashboard. These cells do not need input from the user.","No"]
[null,null,"Output cell","Output cells draw on calculation cells to report results of the tool. These cells do not require input from the user.","No"]
{"$rows_left_out":63}
{"sheet":"Outputs =>","index":2,"n_rows":1,"n_cols":1,"rows_kept":1,"cut":false,"hidden":false,"merged":[]}
[{"$f":"MID(CELL(\"filename\",A2),FIND(\"]\",CELL(\"filename\",A2))+1,256)","v":"Outputs =>"}]

{"sheet":"O1 User interface","index":3,"n_rows":17,"n_cols":7,"rows_kept":17,"cut":false,"hidden":false,"merged":[[6,1,6,6]]}
[{"$f":"MID(CELL(\"filename\",A2),FIND(\"]\",CELL(\"filename\",A2))+1,256)","v":"O1 User interface"}]
[]
[]
[null,"User interface"]
[]
[null,"Description"]
[null,"This tab enables users to input parameters that define the scenarios to be examined. These parameters include levels of funding and performance outcomes, eg, target level of reduced fatalities over the next 10 years."]
[]
[null,"Scenario construction"]
[]
[null,"Scenario construction"]
[]
[null,"Scenario","Budget ($)","Target number of lives saved over next 10 years","Target number of hours saved (millions)","Maximum risk tolerance","Weighted proportion of road in pavement condition"]
[null,"Scenario 1",200000000,0,0,25,0]
[null,"Scenario 2",100000000,0,0,25,0]
[null,"Scenario 3",200000000,60,0,15,0]
[null,"Scenario 4",200000000,90,0,15,0]

{"sheet":"O2 Dashboard","index":4,"n_rows":84,"n_cols":25,"rows_kept":84,"cut":false,"hidden":false,"merged":[]}
[{"$f":"MID(CELL(\"filename\",A2),FIND(\"]\",CELL(\"filename\",A2))+1,256)","v":"O2 Dashboard"}]
[]
[null,"Scenario selection"]
[]
[null,"Active scenario"]
[null,"Scenario selection/index","Scenario 1",{"$f":"MATCH(C6,'I2 Definitions'!B12:B15,0)","v":1}]
[]
[]
[]
[null,{"$f":"\"Portfolio outcomes under \" & active_scenario","v":"Portfolio outcomes under Scenario 1"}]
[]
[null,"Aggregate portfolio characteristics"]
[]
[null,"Breakdown of portfolio net present value ($m)",null,null,null,null,"Summary of portfolio characteristics",null,null,null,null,null,null,"Portfolio composition"]
[null,null,null,null,null,null,"Outcome","Funding all investments","Scenario 1","Scenario 2","Scenario 3","Scenario 4",null,{"$f":"'C2 Dashboard data'!B22","v":"Project"},{"$f":"'C2 Dashboard data'!M22","v":"Asset class"},{"$f":"'C2 Dashboard data'!C22","v":"NPV ($m)"},{"$f":"'C2 Dashboard data'!D22","v":"Costs (PV $m)"},{"$f":"'C2 Dashboard data'!E22","v":"Safety benefits (PV $m)"},{"$f":"'C2 Dashboard data'!F22","v":"User travel costs (PV $m)"},{"$f":"'C2 Dashboard data'!G22","v":"Other benefits (PV $m)"},{"$f":"'C2 Dashboard data'!H22","v":"Lives saved over first 10 years"},{"$f":"'C2 Dashboard data'!I22","v":"Hours of travel time saved (millions)"},"Length of road (km)","Proportion of road in good condition (without investment)","Proportion of road in good condition (with investment)"]
[null,null,null,null,null,null,"Expected avoided fatalities (first ten years)",{"$f":"SUM('I1 Inputs'!L13:L42)","v":130.01},{"$f":"'C1 Portfolio construction'!I93","v":49.01},{"$f":"'C1 Portfolio construction'!I128","v":42.01},{"$f":"'C1 Portfolio construction'!I163","v":76.010000000000005},{"$f":"'C1 Portfolio construction'!I198","v":91.01},null,{"$f":"'C2 Dashboard data'!B23","v":"Project 7"},{"$f":"'C2 Dashboard data'!M23","v":"Pavements"},{"$f":"'C2 Dashboard data'!C23","v":87.859091000000006},{"$f":"'C2 Dashboard data'!D23","v":43.222042000000002},{"$f":"'C2 Dashboard data'!E23","v":73.826635999999993},{"$f":"'C2 Dashboard data'!F23","v":52.824103999999998},{"$f":"'C2 Dashboard data'!G23","v":4.4303929999999996},{"$f":"'C2 Dashboard data'!H23","v":7},{"$f":"'C2 Dashboard data'!I23","v":1},{"$f":"'C2 Dashboard data'!O23","v":400},{"$f":"'C2 Dashboard data'!P23","v":0.93},{"$f":"'C2 Dashboard data'!Q23","v":0.96}]
[null,null,null,null,null,null,"Hours of travel time saved (millions)",{"$f":"SUM('I1 Inputs'!M13:M42)","v":51.5},{"$f":"'C1 Portfolio construction'!J93","v":14.5},{"$f":"'C1 Portfolio construction'!J128","v":18.2},{"$f":"'C1 Portfolio construction'!J163","v":29.5},{"$f":"'C1 Portfolio construction'!J198","v":42.5},null,{"$f":"'C2 Dashboard data'!B24","v":"Project 9"},{"$f":"'C2 Dashboard data'!M24","v":"Pavements"},{"$f":"'C2 Dashboard data'!C24","v":87.609939999999995},{"$f":"'C2 Dashboard data'!D24","v":36.179264000000003},{"$f":"'C2 Dashboard data'!E24","v":72.353852000000003},{"$f":"'C2 Dashboard data'!F24","v":46.891955000000003},{"$f":"'C2 Dashboard data'!G24","v":4.5433969999999997},{"$f":"'C2 Dashboard data'!H24","v":6},{"$f":"'C2 Dashboard data'!I24","v":1},{"$f":"'C2 Dashboard data'!O24","v":800},{"$f":"'C2 Dashboard data'!P24","v":0.88},{"$f":"'C2 Dashboard data'!Q24","v":0.93}]
[null,null,null,null,null,null,"Net benefits ($m)",{"$f":"SUM('I1 Inputs'!G13:G42)/10^6","v":428.81099962900652},{"$f":"'C1 Portfolio construction'!D93/10^6","v":429.4257836290065},{"$f":"'C1 Portfolio construction'!D128/10^6","v":209.30795977830792},{"$f":"'C1 Portfolio construction'!D163/10^6","v":377.2919136290065},{"$f":"'C1 Portfolio construction'!D198/10^6","v":201.72852762900649},null,{"$f":"'C2 Dashboard data'!B25","v":"Project 6"},{"$f":"'C2 Dashboard data'!M25","v":"Pavements"},{"$f":"'C2 Dashboard data'!C25","v":84.135931850698611},{"$f":"'C2 Dashboard data'!D25","v":35.6698474108764},{"$f":"'C2 Dashboard data'!E25","v":61.474904493569227},{"$f":"'C2 Dashboard data'!F25","v":54.4355033930091},{"$f":"'C2 Dashboard data'!G25","v":3.8953713749966639},{"$f":"'C2 Dashboard data'!H25","v":8},{"$f":"'C2 Dashboard data'!I25","v":1.3},{"$f":"'C2 Dashboard data'!O25","v":400},{"$f":"'C2 Dashboard data'!P25","v":0.9},{"$f":"'C2 Dashboard data'!Q25","v":0.97}]
[null,null,null,null,null,null,"Total benefits ($m)",{"$f":"SUM('I1 Inputs'!I13:K42)/10^6","v":759.76316873666951},{"$f":"SUM('C1 Portfolio construction'!F93:H93)/10^6","v":618.61557173666949},{"$f":"SUM('C1 Portfolio construction'!F128:H128)/10^6","v":307.91713747509459},{"$f":"SUM('C1 Portfolio construction'!F163:H163)/10^6","v":564.1013977366697},{"$f":"SUM('C1 Portfolio construction'!F198:H198)/10^6","v":390.97087873666953},null,{"$f":"'C2 Dashboard data'!B26","v":"Project 10"},{"$f":"'C2 Dashboard data'!M26","v":"Pavements"},{"$f":"'C2 Dashboard data'!C26","v":80.506112000000002},{"$f":"'C2 Dashboard data'!D26","v":31.160640999999998},{"$f":"'C2 Dashboard data'!E26","v":48.959367999999998},{"$f":"'C2 Dashboard data'!F26","v":59.569752000000001},{"$f":"'C2 Dashboard data'!G26","v":3.1376330000000001},{"$f":"'C2 Dashboard data'!H26","v":9},{"$f":"'C2 Dashboard data'!I26","v":1},{"$f":"'C2 Dashboard data'!O26","v":1100},{"$f":"'C2 Dashboard data'!P26","v":0.8},{"$f":"'C2 Dashboard data'!Q26","v":0.9}]
[null,null,null,null,null,null,"Capital cost ($m)",{"$f":"SUM('I1 Inputs'!H13:H42)/10^6","v":330.95216910766311},{"$f":"'C1 Portfolio construction'!E93/10^6","v":189.18978810766311},{"$f":"'C1 Portfolio construction'!E128/10^6","v":98.609177696786702},{"$f":"'C1 Portfolio construction'!E163/10^6","v":186.80948410766308},{"$f":"'C1 Portfolio construction'!E198/10^6","v":189.2423511076631},null,{"$f":"'C2 Dashboard data'!B27","v":"Project 8"},{"$f":"'C2 Dashboard data'!M27","v":"Pavements"},{"$f":"'C2 Dashboard data'!C27","v":73.149080999999995},{"$f":"'C2 Dashboard data'!D27","v":38.893698000000001},{"$f":"'C2 Dashboard data'!E27","v":54.183073},{"$f":"'C2 Dashboard data'!F27","v":54.012382000000002},{"$f":"'C2 Dashboard data'!G27","v":3.847324},{"$f":"'C2 Dashboard data'!H27","v":10},{"$f":"'C2 Dashboard data'!I27","v":1},{"$f":"'C2 Dashboard data'!O27","v":800},{"$f":"'C2 Dashboard data'!P27","v":0.94},{"$f":"'C2 Dashboard data'!Q27","v":0.97}]
{"$rows_left_out":65}
{"sheet":"Inputs =>","index":5,"n_rows":1,"n_cols":1,"rows_kept":1,"cut":false,"hidden":false,"merged":[]}
[{"$f":"MID(CELL(\"filename\",A2),FIND(\"]\",CELL(\"filename\",A2))+1,256)","v":"Inputs =>"}]

{"sheet":"I1 Inputs","index":6,"n_rows":42,"n_cols":25,"rows_kept":42,"cut":false,"hidden":false,"merged":[[10,16,10,18],[10,19,10,21],[10,22,10,24],[6,1,6,6],[10,2,10,5],[10,6,10,10],[10,11,10,12],[10,13,10,15]]}
[{"$f":"MID(CELL(\"filename\",A2),FIND(\"]\",CELL(\"filename\",A2))+1,256)","v":"I1 Inputs"}]
[]
[]
[null,"Inputs"]
[]
[null,"Description"]
[null,"The purpose of this tab is for the user to input the necessary data to undertake the optimisation procedure. The inputs that are required cover areas such as project descriptors, outputs of CBA, performance measures, risk assessments and asset condition."]
[]
[null,"Inputs table"]
[]
[null,null,"Project descriptors",null,null,null,"Cost benefit analysis (CBA) outputs",null,null,null,null,"Performance measures",null,"Risk assessment - base case",null,null,"Risk assessment - investment case",null,null,"Pavement condition - base case",null,null,"Pavement condition - investment case"]
[null,"Investment","Service group","Expenditure category","Asset class","Region","NPV ($) (PV of benefits less PV of costs)","PV of costs ($)","PV of safety benefits ($)","PV of user travel cost benefits ($)","PV of other benefits ($)","Lives saved over first 10 years","Hours of travel time saved (millions)","Consequence","Likelihood","Risk score","Consequence","Likelihood","Risk score","Road length (km)","Proportion in bad condition","Proportion in good condition","Road length (km)","Proportion in bad condition","Proportion in good condition"]
[null,"Project 1","Growth and improvement","Capex","Pavements","Urban",-11034738,36229131,11591347,8747343,4855703,15,10,"Serious","Likely",{"$f":"IFERROR(INDEX('I2 Definitions'!$C$28:$G$32,MATCH('I1 Inputs'!$N13,'I2 Definitions'!$B$28:$B$32,0),MATCH('I1 Inputs'!$O13,'I2 Definitions'!$C$27:$G$27,0)),0)","v":12},"Marginal","Possible",{"$f":"IFERROR(INDEX('I2 Definitions'!$C$28:$G$32,MATCH('I1 Inputs'!Q13,'I2 Definitions'!$B$28:$B$32,0),MATCH('I1 Inputs'!R13,'I2 Definitions'!$C$27:$G$27,0)),0)","v":6}]
[null,"Project 2","Growth and improvement","Capex","Pavements","Urban",3587404,33543641,17532153,15291099,4307793,15,5,"Critical","Possible",{"$f":"IFERROR(INDEX('I2 Definitions'!$C$28:$G$32,MATCH('I1 Inputs'!$N14,'I2 Definitions'!$B$28:$B$32,0),MATCH('I1 Inputs'!$O14,'I2 Definitions'!$C$27:$G$27,0)),0)","v":12},"Serious","Unlikely",{"$f":"IFERROR(INDEX('I2 Definitions'!$C$28:$G$32,MATCH('I1 Inputs'!Q14,'I2 Definitions'!$B$28:$B$32,0),MATCH('I1 Inputs'!R14,'I2 Definitions'!$C$27:$G$27,0)),0)","v":6}]
[null,"Project 3","Growth and improvement","Capex","Pavements","Urban",3341910,21369818,12470370,8534573,3706785,17,9,"Catastrophic","Possible",{"$f":"IFERROR(INDEX('I2 Definitions'!$C$28:$G$32,MATCH('I1 Inputs'!$N15,'I2 Definitions'!$B$28:$B$32,0),MATCH('I1 Inputs'!$O15,'I2 Definitions'!$C$27:$G$27,0)),0)","v":15},"Critical","Unlikely",{"$f":"IFERROR(INDEX('I2 Definitions'!$C$28:$G$32,MATCH('I1 Inputs'!Q15,'I2 Definitions'!$B$28:$B$32,0),MATCH('I1 Inputs'!R15,'I2 Definitions'!$C$27:$G$27,0)),0)","v":8}]
[null,"Project 4","Growth and improvement","Capex","Structures","Urban",17673301,15143576,19308954,10772708,2735215,20,7,"Serious","Almost certain",{"$f":"IFERROR(INDEX('I2 Definitions'!$C$28:$G$32,MATCH('I1 Inputs'!$N16,'I2 Definitions'!$B$28:$B$32,0),MATCH('I1 Inputs'!$O16,'I2 Definitions'!$C$27:$G$27,0)),0)","v":15},"Marginal","Likely",{"$f":"IFERROR(INDEX('I2 Definitions'!$C$28:$G$32,MATCH('I1 Inputs'!Q16,'I2 Definitions'!$B$28:$B$32,0),MATCH('I1 Inputs'!R16,'I2 Definitions'!$C$27:$G$27,0)),0)","v":8}]
[null,"Project 5","Growth and improvement","Capex","Structures","Urban",-14182661,35476215,3981849,10729572,6582133,14,6,"Catastrophic","Rare",{"$f":"IFERROR(INDEX('I2 Definitions'!$C$28:$G$32,MATCH('I1 Inputs'!$N17,'I2 Definitions'!$B$28:$B$32,0),MATCH('I1 Inputs'!$O17,'I2 Definitions'!$C$27:$G$27,0)),0)","v":5},"Critical","Rare",{"$f":"IFERROR(INDEX('I2 Definitions'!$C$28:$G$32,MATCH('I1 Inputs'!Q17,'I2 Definitions'!$B$28:$B$32,0),MATCH('I1 Inputs'!R17,'I2 Definitions'!$C$27:$G$27,0)),0)","v":4}]
[null,"Project 6","Asset maintenance","Opex","Pavements","Urban",84135931.850698605,35669847.410876401,61474904.493569225,54435503.393009096,3895371.374996664,8,1.3,null,null,{"$f":"IFERROR(INDEX('I2 Definitions'!$C$28:$G$32,MATCH('I1 Inputs'!$N18,'I2 Definitions'!$B$28:$B$32,0),MATCH('I1 Inputs'!$O18,'I2 Definitions'!$C$27:$G$27,0)),0)","v":0},null,null,{"$f":"IFERROR(INDEX('I2 Definitions'!$C$28:$G$32,MATCH('I1 Inputs'!Q18,'I2 Definitions'!$B$28:$B$32,0),MATCH('I1 Inputs'!R18,'I2 Definitions'!$C$27:$G$27,0)),0)","v":0},400,0.1,0.9,400,0.03,0.97]
[null,"Project 7","Asset maintenance","Opex","Pavements","Urban",87859091,43222042,73826636,52824104,4430393,7,1,null,null,{"$f":"IFERROR(INDEX('I2 Definitions'!$C$28:$G$32,MATCH('I1 Inputs'!$N19,'I2 Definitions'!$B$28:$B$32,0),MATCH('I1 Inputs'!$O19,'I2 Definitions'!$C$27:$G$27,0)),0)","v":0},null,null,{"$f":"IFERROR(INDEX('I2 Definitions'!$C$28:$G$32,MATCH('I1 Inputs'!Q19,'I2 Definitions'!$B$28:$B$32,0),MATCH('I1 Inputs'!R19,'I2 Definitions'!$C$27:$G$27,0)),0)","v":0},400,7.0000000000000007E-2,0.93,400,0.04,0.96]
[null,"Project 8","Asset maintenance","Opex","Pavements","Urban",73149081,38893698,54183073,54012382,3847324,10,1,null,null,{"$f":"IFERROR(INDEX('I2 Definitions'!$C$28:$G$32,MATCH('I1 Inputs'!$N20,'I2 Definitions'!$B$28:$B$32,0),MATCH('I1 Inputs'!$O20,'I2 Definitions'!$C$27:$G$27,0)),0)","v":0},null,null,{"$f":"IFERROR(INDEX('I2 Definitions'!$C$28:$G$32,MATCH('I1 Inputs'!Q20,'I2 Definitions'!$B$28:$B$32,0),MATCH('I1 Inputs'!R20,'I2 Definitions'!$C$27:$G$27,0)),0)","v":0},800,0.06,0.94,800,0.03,0.97]
{"$rows_left_out":23}
{"sheet":"I2 Definitions","index":7,"n_rows":37,"n_cols":7,"rows_kept":37,"cut":false,"hidden":false,"merged":[[6,1,6,6]]}
[{"$f":"MID(CELL(\"filename\",A2),FIND(\"]\",CELL(\"filename\",A2))+1,256)","v":"I2 Definitions"}]
[]
[]
[null,"Definitions"]
[]
[null,"Description"]
[null,"The purpose of this tab is for the user to populate the naming conventions used in the drop-down boxes used elsewhere in the tool. In other words, the user can adjust the default naming conventions to reflect their road authority's approach to descriptions regarding characteristics such as service groups."]
[]
[null,"Scenario naming"]
[]
[null,"Scenarios"]
[null,"Scenario 1"]
[null,"Scenario 2"]
[null,"Scenario 3"]
[null,"Scenario 4"]
[]
[null,"Project descriptions"]
[]
[null,"Service groups","Expenditure categories","Asset class","Region"]
[null,"Asset maintenance","Opex","Pavements","Urban"]
{"$rows_left_out":18}
{"sheet":"Calculations =>","index":8,"n_rows":1,"n_cols":1,"rows_kept":1,"cut":false,"hidden":false,"merged":[]}
[{"$f":"MID(CELL(\"filename\",A2),FIND(\"]\",CELL(\"filename\",A2))+1,256)","v":"Calculations =>"}]

{"sheet":"C1 Portfolio construction","index":9,"n_rows":198,"n_cols":37,"rows_kept":198,"cut":false,"hidden":false,"merged":[[6,1,6,6]]}
[{"$f":"MID(CELL(\"filename\",A2),FIND(\"]\",CELL(\"filename\",A2))+1,256)","v":"C1 Portfolio construction"}]
[]
[]
[null,"Portfolio construction"]
[]
[null,"Description"]
[null,"This tab contains the calculation of the optimal investment portfolio under each of the scenarios defined on the 'O1 User interface' tab. To commence the optimisation procedure, click the 'run optimisation procedure' button below. Clicking this button will trigger a macro that cycles through each of the defined scenarios, calculates the optimal investment portfolio and pastes the results in the relevant cells below."]
[]
[null,{"$f":"\"Optimisation parameters - \" & active_scenario","v":"Optimisation parameters - Scenario 1"}]
[]
[null,"Parameter","Value"]
[null,"Total funding required ($)",{"$f":"SUM('I1 Inputs'!H13:H42)","v":330952169.10766309}]
[null,"Available funding ($)",{"$f":"CHOOSE('O2 Dashboard'!D6,'O1 User interface'!C14,'O1 User interface'!C15,'O1 User interface'!C16,'O1 User interface'!C17)","v":200000000}]
[null,"Funding used ($)",{"$f":"SUM(E26:E55)","v":189242351.10766309}]
[null,"Remaining funding ($)",{"$f":"C13-C14","v":10757648.892336905}]
[null,"NPV of funded projects ($)",{"$f":"SUM(D26:D55)","v":201728527.62900651}]
[null,"Maximum risk score tolerance",{"$f":"CHOOSE('O2 Dashboard'!D6,'O1 User interface'!F14,'O1 User interface'!F15,'O1 User interface'!F16,'O1 User interface'!F17)","v":25}]
[null,"Projects exceeded risk tolerance",{"$f":"SUM(L26:L55)","v":0}]
[null,"Lives saved over 10 years target",{"$f":"CHOOSE('O2 Dashboard'!D6,'O1 User interface'!D14,'O1 User interface'!D15,'O1 User interface'!D16,'O1 User interface'!D17)","v":0}]
[null,"Millions of hours of travel time saved",{"$f":"CHOOSE('O2 Dashboard'!$D$6,'O1 User interface'!E14,'O1 User interface'!E15,'O1 User interface'!E16,'O1 User interface'!E17)","v":0}]
{"$rows_left_out":179}
{"sheet":"C2 Dashboard data","index":10,"n_rows":139,"n_cols":17,"rows_kept":139,"cut":false,"hidden":false,"merged":[[6,1,6,6]]}
[{"$f":"MID(CELL(\"filename\",A2),FIND(\"]\",CELL(\"filename\",A2))+1,256)","v":"C2 Dashboard data"}]
[]
[]
[null,"Dashboard data"]
[]
[null,"Description"]
[null,"This tab contains the calculations underpinning the charts presented on the 'O2 Dashboard' tab."]
[]
[null,"Aggregate portfolio statistics"]
[]
[null,{"$f":"\"Breakdown of net present value under \" & active_scenario","v":"Breakdown of net present value under Scenario 1"}]
[]
[null,"NPV component","Value ($m)"]
[null,"Capital cost",{"$f":"-CHOOSE('O2 Dashboard'!D6,'C1 Portfolio construction'!E93,'C1 Portfolio construction'!E128,'C1 Portfolio construction'!E163,'C1 Portfolio construction'!E198)/10^6","v":-189.18978810766311}]
[null,"Safety",{"$f":"CHOOSE('O2 Dashboard'!D6,'C1 Portfolio construction'!F93,'C1 Portfolio construction'!F128,'C1 Portfolio construction'!F163,'C1 Portfolio construction'!F198)/10^6","v":310.9854086511487}]
[null,"User travel costs",{"$f":"CHOOSE('O2 Dashboard'!D6,'C1 Portfolio construction'!G93,'C1 Portfolio construction'!G128,'C1 Portfolio construction'!G163,'C1 Portfolio construction'!G198)/10^6","v":278.23925462753169}]
[null,"Other",{"$f":"CHOOSE('O2 Dashboard'!D6,'C1 Portfolio construction'!H93,'C1 Portfolio construction'!H128,'C1 Portfolio construction'!H163,'C1 Portfolio construction'!H198)/10^6","v":29.390908457989234}]
[null,"NPV",{"$f":"CHOOSE('O2 Dashboard'!D6,'C1 Portfolio construction'!D93,'C1 Portfolio construction'!D128,'C1 Portfolio construction'!D163,'C1 Portfolio construction'!D198)/10^6","v":429.4257836290065}]
[]
[null,{"$f":"\"Portfolio composition under \" & active_scenario","v":"Portfolio composition under Scenario 1"}]
{"$rows_left_out":119}